Image test comparison

14 passed hash comparison, although 3 of those have a different baseline image

19 failed hash comparison, although 6 of those have a matching baseline image

Download generated hash library

Baseline Diff Result
subtests.subtest.test_functions
test_hmissing_imissing
FAILED
RMS: None (missing)
Result hash: 2d15274f0e9b44f1c16e6b237710cd36a3de5c5b7596ef0e65e7a33ce4624cf4 (missing)
subtests.subtest.test_functions
test_hmissing_idiff
FAILED
RMS: 24.6217358806762 (diff)
Result hash: 9e98dbd2027525c776212daa061180b4fc40ad12dfc2cdfe4b86694ede14e0c3 (missing)
subtests.subtest.test_functions
test_hmissing_idiffshape
FAILED
RMS: None (diff)
Result hash: 5534324f9da5c1c104c3ef3435dc6fa9792c0d0d8b762fad5d7f81abd91fbb89 (missing)
subtests.subtest.test_functions
test_hdiff_imissing
FAILED
RMS: None (missing)
Result hash: e37bd5868d14547557653c051d23d3fd48d198d3f59006dc5ba390433d6670ff (diff)
subtests.subtest.test_functions
test_hmissing_imatch
FAILED
RMS: < tolerance (match)
Result hash: 592d12cc2d5749a6607bbf98d715b95c06a2af6572a7e298bcae349648b9997e (missing)
subtests.subtest.test_classes.TestClass
test_hdiff_idiff_testclass
FAILED
RMS: 24.536840442259244 (diff)
Result hash: 2bb430367cdf04b7b5f3af8c50652964ff27def9fc0a75a68b4775ba1eb8e827 (diff)
subtests.subtest.test_classes.TestClassWithSetupMethod
test_hdiff_idiff_testclasswithsetupmethod
FAILED
RMS: 24.537034749650488 (diff)
Result hash: 56d00363330cb7d959d6cfdc1335901716e841f54014cb6e657d1c4721384252 (diff)
subtests.subtest.test_classes.TestClassWithSetupClass
test_hdiff_idiff_testclasswithsetupclass
FAILED
RMS: 24.563779228775037 (diff)
Result hash: 8c4fa5f95b2a2b424ad9e441b6aeeced9d51a52fe7f19870eedcdfdcf6d39818 (diff)
subtests.subtest.test_functions
test_hdiff_idiff
FAILED
RMS: 24.620185259705547 (diff)
Result hash: 567f014f73cdfea555e46a29aaac43c4394c3c4c21998e54971edb773eee6c95 (diff)
subtests.subtest.test_functions
test_hdiff_idiffshape
FAILED
RMS: None (diff)
Result hash: b6673bafdcc8350c612bc925269fc4332dd9062a6399701067863b178568b219 (diff)
subtests.subtest.test_special
test_hdiff_idiff_tolerance
FAILED
RMS: 24.576566752362574 (diff)
Result hash: f26ca66a7c02ae64c8b2512021e0450cbe64c084c9d5f7e2600a7342a559c0b1 (diff)
subtests.subtest.test_unittest.TestCase
test_hdiff_idiff_testclass
FAILED
RMS: 24.536840442259244 (diff)
Result hash: 2bb430367cdf04b7b5f3af8c50652964ff27def9fc0a75a68b4775ba1eb8e827 (diff)
subtests.subtest.test_unittest.TestCaseWithSetUp
test_hdiff_idiff_testcasewithsetup
FAILED
RMS: 24.537034749650488 (diff)
Result hash: 56d00363330cb7d959d6cfdc1335901716e841f54014cb6e657d1c4721384252 (diff)
subtests.subtest.test_unittest.TestCaseWithSetUpClass
test_hdiff_idiff_testcasewithsetupclass
FAILED
RMS: 24.520257314106637 (diff)
Result hash: 5f1e6e2b775a1b1d1e9e20a4d929586a9accb08b2fddaec8a24fb4acfc83c602 (diff)
subtests.subtest.test_functions
test_hdiff_imatch
FAILED
RMS: < tolerance (match)
Result hash: b92c5c6bc631fbdaffa23d3d57fc027768fcded889f3b269941da859110ce282 (diff)
subtests.subtest.test_special
test_hdiff_imatch_tolerance
FAILED
RMS: < tolerance (match)
Result hash: f26ca66a7c02ae64c8b2512021e0450cbe64c084c9d5f7e2600a7342a559c0b1 (diff)
subtests.subtest.test_special
test_hdiff_imatch_savefig
FAILED
RMS: < tolerance (match)
Result hash: 0a0514c35f1da18de3f4ceb1901501e5a8a5a0d18eb8a7b4db5cfde170b57423 (diff)
subtests.subtest.test_special
test_hdiff_imatch_style
FAILED
RMS: < tolerance (match)
Result hash: 588ad00c4b99c6087d04f84ca071a5997b4ecf76cf859ce3548634e67841a79b (diff)
subtests.subtest.test_special
test_hdiff_imatch_removetext
FAILED
RMS: < tolerance (match)
Result hash: a78ad7512c6d886262b1bcb4501374bfc61ef8569d24930b0258dab08e6eca9a (diff)
subtests.subtest.test_functions
test_hmatch_imissing
PASSED
RMS: None (missing)
Result hash: f06e910b6c80db28e1eb08fdb8e1ab9211434498c134d00820900a13a4f2568c (match)
subtests.subtest.test_functions
test_hmatch_idiff
PASSED
RMS: 24.618234716477044 (diff)
Result hash: 085fcb22e9d6cfbb2bb6e0efbf749fa598be27e837c348130adc21a6dc2fc5fe (match)
subtests.subtest.test_functions
test_hmatch_idiffshape
PASSED
RMS: None (diff)
Result hash: a8f866c3b765e274c217d49ba72c9ce3bd4b316491ffd34a124ef03643ce45b8 (match)
subtests.subtest.test_classes.TestClass
test_hmatch_imatch_testclass
PASSED
RMS: < tolerance (match)
Result hash: af966da7f2e57908211d559ff0a24a52c363c3fabca9e810138ad60e3fd2bcc9 (match)
subtests.subtest.test_classes.TestClassWithSetupMethod
test_hmatch_imatch_testclasswithsetupmethod
PASSED
RMS: < tolerance (match)
Result hash: 56d00363330cb7d959d6cfdc1335901716e841f54014cb6e657d1c4721384252 (match)
subtests.subtest.test_classes.TestClassWithSetupClass
test_hmatch_imatch_testclasswithsetupclass
PASSED
RMS: < tolerance (match)
Result hash: 8c4fa5f95b2a2b424ad9e441b6aeeced9d51a52fe7f19870eedcdfdcf6d39818 (match)
subtests.subtest.test_classes.TestClassWithFixture
test_hmatch_imatch_testclasswithfixture
PASSED
RMS: < tolerance (match)
Result hash: e644cc970103f69d66d1a96d4360233a58f0912fa6f5089ccf9c2a4cf9f5194e (match)
subtests.subtest.test_classes.TestMultipleFigures
test_hmatch_imatch_multiplefigures_first
PASSED
RMS: < tolerance (match)
Result hash: ed64b8ac43a2b6a73b26d4124cc4bb78c946df6680b5b69daece38054a50e934 (match)
subtests.subtest.test_classes.TestMultipleFigures
test_hmatch_imatch_multiplefigures_second
PASSED
RMS: < tolerance (match)
Result hash: 96afad36d992a9aecfbed568031c2da4a214c904a454028950beea68be2b5886 (match)
subtests.subtest.test_functions
test_hmatch_imatch
PASSED
RMS: < tolerance (match)
Result hash: d21af7f9a2c1cbaf3c9bca3598f1b32b36891ac9d5db47e81a7bcaa342f7d4fc (match)
subtests.subtest.test_nose
test_hmatch_imatch_testnose
PASSED
RMS: < tolerance (match)
Result hash: 4fe8a2917a9353e6a6f4a3cebe735be9746673db41c4c2fd549c1fd0bc89a547 (match)
subtests.subtest.test_unittest.TestCase
test_hmatch_imatch_testclass
PASSED
RMS: < tolerance (match)
Result hash: af966da7f2e57908211d559ff0a24a52c363c3fabca9e810138ad60e3fd2bcc9 (match)
subtests.subtest.test_unittest.TestCaseWithSetUp
test_hmatch_imatch_testcasewithsetup
PASSED
RMS: < tolerance (match)
Result hash: 56d00363330cb7d959d6cfdc1335901716e841f54014cb6e657d1c4721384252 (match)
subtests.subtest.test_unittest.TestCaseWithSetUpClass
test_hmatch_imatch_testcasewithsetupclass
PASSED
RMS: < tolerance (match)
Result hash: 5f1e6e2b775a1b1d1e9e20a4d929586a9accb08b2fddaec8a24fb4acfc83c602 (match)